BDBM50006969 CHEMBL20768::[2-(4-Ethoxy-phenyl)-1-methyl-ethyl]-(3-phenyl-propyl)-amine
SMILES CCOc1ccc(CC(C)NCCCc2ccccc2)cc1
InChI Key InChIKey=JNGOZXBXXKVROX-UHFFFAOYSA-N
Data  2 KI
  Tab Delimited (TSV)   2D SDfile   Computed 3D by Vconf -m prep SDfile
Find this compound or compounds like it in BindingDB:
Activity Spreadsheet -- Enzyme Inhibition Constant Data from BindingDB
Found 2 hits for monomerid = 50006969
TargetSigma non-opioid intracellular receptor 1(Homo sapiens (Human))
Virginia Commonwealth University
Curated by ChEMBL
LigandPNGBDBM50006969(CHEMBL20768 | [2-(4-Ethoxy-phenyl)-1-methyl-ethyl]...)
Affinity DataKi:  3.40nM. Assay description: Binding affinity against sigma-1 receptor of guinea pig brain membranes using [3H]-pentazocine as radioligand
In DepthDetails ArticlePubMed
TargetSigma non-opioid intracellular receptor 1(Homo sapiens (Human))
Virginia Commonwealth University
Curated by ChEMBL
LigandPNGBDBM50006969(CHEMBL20768 | [2-(4-Ethoxy-phenyl)-1-methyl-ethyl]...)
Affinity DataKi:  6.80nM. Assay description: Opioid activity in terms of inhibition of [3H]dihydromorphine binding to opioid receptor mu in rat brain membrane.
In DepthDetails ArticlePubMed