BDBM50006975 CHEMBL19802::[2-(4-Bromo-phenyl)-1-methyl-ethyl]-(3-phenyl-propyl)-amine
SMILES CC(Cc1ccc(Br)cc1)NCCCc1ccccc1
InChI Key InChIKey=TWSHNGSMVLDKOH-UHFFFAOYSA-N
Data  2 KI
  Tab Delimited (TSV)   2D SDfile   Computed 3D by Vconf -m prep SDfile
Find this compound or compounds like it in BindingDB:
Activity Spreadsheet -- Enzyme Inhibition Constant Data from BindingDB
Found 2 hits for monomerid = 50006975
TargetSigma non-opioid intracellular receptor 1(Homo sapiens (Human))
Virginia Commonwealth University
Curated by ChEMBL
LigandPNGBDBM50006975(CHEMBL19802 | [2-(4-Bromo-phenyl)-1-methyl-ethyl]-...)
Affinity DataKi:  8.80nM. Assay description: Inhibition of [3H]DTG binding to Sigma opioid receptor
In DepthDetails ArticlePubMed
TargetSigma non-opioid intracellular receptor 1(Homo sapiens (Human))
Virginia Commonwealth University
Curated by ChEMBL
LigandPNGBDBM50006975(CHEMBL19802 | [2-(4-Bromo-phenyl)-1-methyl-ethyl]-...)
Affinity DataKi:  12nM. Assay description: Binding affinity against sigma-1 receptor of guinea pig brain membranes using [3H]-pentazocine as radioligand
In DepthDetails ArticlePubMed