BDBM50007512 CHEMBL367065::N-(1-Benzyl-pyrrolidin-2-ylmethyl)-3-bromo-2,6-dimethoxy-benzamide
SMILES COc1ccc(Br)c(OC)c1C(=O)NC[C@@H]1CCCN1Cc1ccccc1
InChI Key InChIKey=BGNYQRZTZGGUOK-INIZCTEOSA-N
Data  1 IC50
  Tab Delimited (TSV)   2D SDfile   Computed 3D by Vconf -m prep SDfile
Find this compound or compounds like it in BindingDB:
Activity Spreadsheet -- Enzyme Inhibition Constant Data from BindingDB
Found 1 hit for monomerid = 50007512
TargetD(2) dopamine receptor(Rattus norvegicus (rat))
Astra Research Centre
Curated by ChEMBL
LigandPNGBDBM50007512(CHEMBL367065 | N-(1-Benzyl-pyrrolidin-2-ylmethyl)-...)
Affinity DataIC50:  1.63E+4nM. Assay description: Inhibition of [3H]spiperone binding to rat striatal dopamine receptor D2 was determined in vitro
In DepthDetails ArticlePubMed