BDBM50008151 2-[3-Phenyl-2-(3-pyridin-3-yl-propionylamino)-propionylamino]-pent-4-enoic acid [1-cyclohexylmethyl-3,3-difluoro-3-(2-morpholin-4-yl-ethylcarbamoyl)-2-oxo-propyl]-amide::CHEMBL29323
SMILES FC(F)(C(=O)NCCN1CCOCC1)C(=O)[C@H](CC1CCCCC1)NC(=O)[C@H](CC=C)NC(=O)[C@H](Cc1ccccc1)NC(=O)CCc1cccnc1
InChI Key InChIKey=RYIXIUHRDBEHJF-ZDCRTTOTSA-N
Data  2 IC50
  Tab Delimited (TSV)   2D SDfile   Computed 3D by Vconf -m prep SDfile
Find this compound or compounds like it in BindingDB:
Activity Spreadsheet -- Enzyme Inhibition Constant Data from BindingDB
Found 2 hits for monomerid = 50008151
TargetRenin(Homo sapiens (Human))
Warner-Lambert
Curated by ChEMBL
LigandPNGBDBM50008151(2-[3-Phenyl-2-(3-pyridin-3-yl-propionylamino)-prop...)
Affinity DataIC50:  0.230nM. Assay description: The concentration producing 50% inhibition of renin activity in monkey plasma was determined by radioimmunoassay.
In DepthDetails ArticlePubMed
TargetCathepsin D(Bos taurus)
Warner-Lambert
Curated by ChEMBL
LigandPNGBDBM50008151(2-[3-Phenyl-2-(3-pyridin-3-yl-propionylamino)-prop...)
Affinity DataIC50:  1.66E+3nM. Assay description: Inhibitory activity against bovine Cathepsin D
In DepthDetails ArticlePubMed