BDBM50008868 CHEMBL3237010
SMILES CN(c1ccc(cc1)C(C)=O)S(=O)(=O)c1cccc(c1)C(=O)Nc1ccc(Cl)cc1
InChI Key InChIKey=SLSQMTRGXAOYNQ-UHFFFAOYSA-N
Data  1 IC50
  Tab Delimited (TSV)   2D SDfile   Computed 3D by Vconf -m prep SDfile
Find this compound or compounds like it in BindingDB:
Activity Spreadsheet -- Enzyme Inhibition Constant Data from BindingDB
Found 1 hit for monomerid = 50008868
TargetNAD-dependent protein deacetylase sirtuin-2(Homo sapiens (Human))
Northwestern University
Curated by ChEMBL
LigandPNGBDBM50008868(CHEMBL3237010)
Affinity DataIC50:  6.80E+3nM. Assay description: Inhibition of SIRT-2 (unknown origin) by fluorescence assay
In DepthDetails ArticlePubMed