BDBM50008874 9-Chloro-2-furan-2-yl-6H-[1,2,4]triazolo[1,5-c]quinazolin-5-one::CHEMBL414023
SMILES Clc1ccc2[nH]c(=O)n3nc(nc3c2c1)-c1ccco1
InChI Key InChIKey=XEVZWKHGVYHGAM-UHFFFAOYSA-N
Data  3 KI  2 IC50
  Tab Delimited (TSV)   2D SDfile   Computed 3D by Vconf -m prep SDfile
Find this compound or compounds like it in BindingDB:
Activity Spreadsheet -- Enzyme Inhibition Constant Data from BindingDB
Found 5 hits for monomerid = 50008874
TargetAdenosine receptor A3(Homo sapiens (Human))
National Institute Of Diabetes
Curated by ChEMBL
LigandPNGBDBM50008874(9-Chloro-2-furan-2-yl-6H-[1,2,4]triazolo[1,5-c]qui...)
Affinity DataKi:  260nM. Assay description: In vitro binding affinity at human Adenosine A3 receptor from HEK-293 cells by [125I]-AB-MECA displacement.
In DepthDetails ArticlePubMed
TargetAdenosine receptor A1(Rattus norvegicus (rat))
National Institute Of Diabetes
Curated by ChEMBL
LigandPNGBDBM50008874(9-Chloro-2-furan-2-yl-6H-[1,2,4]triazolo[1,5-c]qui...)
Affinity DataKi:  3.95E+3nM. Assay description: Displacement of [3H]-¿-PIA from Adenosine A1 receptor of rat cerebral cortex membranes
In DepthDetails ArticlePubMed
TargetAdenosine receptor A2a(Rattus norvegicus (rat))
National Institute Of Diabetes
Curated by ChEMBL
LigandPNGBDBM50008874(9-Chloro-2-furan-2-yl-6H-[1,2,4]triazolo[1,5-c]qui...)
Affinity DataKi:  4.38E+3nM. Assay description: Displacement of [3H]-CGH 21680 from Adenosine A2A receptor of rat striatal membranes
In DepthDetails ArticlePubMed
TargetAdenosine receptor A1(Rattus norvegicus (rat))
National Institute Of Diabetes
Curated by ChEMBL
LigandPNGBDBM50008874(9-Chloro-2-furan-2-yl-6H-[1,2,4]triazolo[1,5-c]qui...)
Affinity DataIC50:  1.00E+4nM. Assay description: Inhibition of binding towards adenosine A1 receptor using [3H]-N-cyclohexyladenosine ([3H]-CHA) in rat whole brain membranes.
In DepthDetails ArticlePubMed
TargetAdenosine receptor A2a/A2b(Rattus norvegicus)
Ciba-Geigy
Curated by ChEMBL
LigandPNGBDBM50008874(9-Chloro-2-furan-2-yl-6H-[1,2,4]triazolo[1,5-c]qui...)
Affinity DataIC50: >1.00E+4nM. Assay description: Inhibition of binding to Adenosine-2 receptor using [3H]NECA in rat striatum
In DepthDetails ArticlePubMed