BDBM50009140 2-(2-{2-[2-(2-{2-[2-Amino-3-(4-hydroxy-phenyl)-propionylamino]-4-methylsulfanyl-butyrylamino}-3-phenyl-propionylamino)-3-(3H-imidazol-4-yl)-propionylamino]-4-methyl-pentanoylamino}-3-carboxy-propionylamino)-succinic acid::CHEMBL417837
SMILES CSCC[C@@H](NC(=O)[C@@H](N)Cc1ccc(O)cc1)C(=O)N[C@@H](Cc1ccccc1)C(=O)N[C@@H](Cc1cnc[nH]1)C(=O)N[C@@H](CC(C)C)C(=O)N[C@@H](CC(O)=O)C(=O)N[C@@H](CC(O)=O)C(O)=O
InChI Key InChIKey=OOMVLVNXYPGDJY-JAKNUFFNSA-N
Data  2 KI
  Tab Delimited (TSV)   2D SDfile   Computed 3D by Vconf -m prep SDfile
Find this compound or compounds like it in BindingDB:
Activity Spreadsheet -- Enzyme Inhibition Constant Data from BindingDB
Found 2 hits for monomerid = 50009140
TargetDelta-type opioid receptor(Rattus norvegicus (rat))
National Institute Of Environmental Health Sciences
Curated by ChEMBL
LigandPNGBDBM50009140(2-(2-{2-[2-(2-{2-[2-Amino-3-(4-hydroxy-phenyl)-pro...)
Affinity DataKi:  6nM. Assay description: Binding affinity against Opioid receptor delta 1 in P2 membrane preparation of rat brain by [3H]DADLE displacement.
In DepthDetails ArticlePubMed
TargetMu-type opioid receptor(Rattus norvegicus (rat))
National Institute Of Environmental Health Sciences
Curated by ChEMBL
LigandPNGBDBM50009140(2-(2-{2-[2-(2-{2-[2-Amino-3-(4-hydroxy-phenyl)-pro...)
Affinity DataKi:  2.09E+3nM. Assay description: Binding affinity against Opioid receptor mu 1 in P2 membrane preparation of rat brain by [3H]DAGO displacement.
In DepthDetails ArticlePubMed