BDBM50009503 CHEMBL3234185
SMILES CC(C)C[C@H](NC(=O)[C@H](C)NC(=O)CNS(=O)(=O)c1ccc(cc1)C(O)=O)C(=O)N[C@@H](CCCC[N+](C)(C)C)C(=O)N[C@@H](CO)C(N)=O
InChI Key InChIKey=YLPDLZXXTDSSIL-HCUBDLJJSA-O
Data  1 IC50
  Tab Delimited (TSV)   2D SDfile   Computed 3D by Vconf -m prep SDfile
Find this compound or compounds like it in BindingDB:
Activity Spreadsheet -- Enzyme Inhibition Constant Data from BindingDB
Found 1 hit for monomerid = 50009503
TargetChromobox protein homolog 7(Homo sapiens (Human))
University Of Victoria
Curated by ChEMBL
LigandPNGBDBM50009503(CHEMBL3234185)
Affinity DataIC50:  5.30E+4nM. Assay description: Displacement of FITC-labeled H3K27me3 from CBX7 (unknown origin) after 15 mins by fluorescence polarization assay
In DepthDetails ArticlePubMed