BDBM50009731 CHEMBL3246897
SMILES CC(CC(O)=O)CC(=O)c1ccc2sc3ccccc3c2c1
InChI Key InChIKey=PEMQXYUJEQLZMT-UHFFFAOYSA-N
Data  3 IC50
  Tab Delimited (TSV)   2D SDfile   Computed 3D by Vconf -m prep SDfile
Find this compound or compounds like it in BindingDB:
Activity Spreadsheet -- Enzyme Inhibition Constant Data from BindingDB
Found 3 hits for monomerid = 50009731
Target3-hydroxy-3-methylglutaryl-coenzyme A reductase(Rattus norvegicus (rat))
TBA
Curated by ChEMBL
LigandPNGBDBM50009731(CHEMBL3246897)
Affinity DataIC50:  1.60E+5nM. Assay description: Inhibition of HMG-coA reductase in CD rat liver microsomal-cytosol fraction assessed as inhibition of nonsaponifiable lipid synthesis using [2-14C]ac...
In DepthDetails ArticlePubMed
Target3-hydroxy-3-methylglutaryl-coenzyme A reductase(Rattus norvegicus (rat))
TBA
Curated by ChEMBL
LigandPNGBDBM50009731(CHEMBL3246897)
Affinity DataIC50:  9.30E+5nM. Assay description: Inhibition of HMG-coA reductase in CD rat liver microsomal-cytosol fraction assessed as inhibition of fatty acid synthesis using [2-14C]acetate as su...
In DepthDetails ArticlePubMed
Target3-hydroxy-3-methylglutaryl-coenzyme A reductase(Rattus norvegicus (rat))
TBA
Curated by ChEMBL
LigandPNGBDBM50009731(CHEMBL3246897)
Affinity DataIC50:  3.10E+5nM. Assay description: Inhibition of HMG-coA reductase in CD rat liver microsomal-cytosol fraction assessed as inhibition of total lipid synthesis using [2-14C]acetate as s...
In DepthDetails ArticlePubMed