BDBM50010846 CHEMBL3264806
SMILES CCCN(CCC)C(=O)c1cc(cc(c1)C(=O)N[C@@H](Cc1ccccc1)[C@H](O)CNC1(CC1)c1cccc(OC)c1)N1CCCCC1
InChI Key InChIKey=MAFOHSLQJYIBJW-MPQUPPDSSA-N
Data  3 IC50
  Tab Delimited (TSV)   2D SDfile   Computed 3D by Vconf -m prep SDfile
Find this compound or compounds like it in BindingDB:
Activity Spreadsheet -- Enzyme Inhibition Constant Data from BindingDB
Found 3 hits for monomerid = 50010846
TargetPlasmepsin II(Plasmodium falciparum)
Latvian Institute Of Organic Synthesis
Curated by ChEMBL
LigandPNGBDBM50010846(CHEMBL3264806)
Affinity DataIC50:  150nM. Assay description: Inhibition of Plasmodium falciparum plasmepsin-2 using DABCYL-Glu-Arg-Nle-Phe-Leu-Ser-Phe-Pro-EDANS as substrate preincubated for 30 mins by FRET ass...
In DepthDetails ArticlePubMed
TargetPlasmepsin I(Plasmodium falciparum)
Latvian Institute Of Organic Synthesis
Curated by ChEMBL
LigandPNGBDBM50010846(CHEMBL3264806)
Affinity DataIC50:  330nM. Assay description: Inhibition of Plasmodium falciparum plasmepsin-1 using DABCYL-Glu-Arg-Nle-Phe-Leu-Ser-Phe-Pro-EDANS as substrate preincubated for 30 mins by FRET ass...
In DepthDetails ArticlePubMed
TargetCathepsin D(Homo sapiens (Human))
Latvian Institute Of Organic Synthesis
Curated by ChEMBL
LigandPNGBDBM50010846(CHEMBL3264806)
Affinity DataIC50:  100nM. Assay description: Inhibition of human cathepsin-D using DABCYL-Glu-Arg-Nle-Phe-Leu-Ser-Phe-Pro-EDANS as substrate preincubated for 30 mins by FRET assay
In DepthDetails ArticlePubMed