BDBM50010899 CHEMBL3264803
SMILES CCCN(CCC)C(=O)c1cc(cc(c1)C(=O)N[C@@H](Cc1ccccc1)[C@H](O)CNC(C)(C)c1cccnc1)N1CCCCC1
InChI Key InChIKey=FAIVGEWDQVKBIM-SZAHLOSFSA-N
Data  3 IC50
  Tab Delimited (TSV)   2D SDfile   Computed 3D by Vconf -m prep SDfile
Find this compound or compounds like it in BindingDB:
Activity Spreadsheet -- Enzyme Inhibition Constant Data from BindingDB
Found 3 hits for monomerid = 50010899
TargetCathepsin D(Homo sapiens (Human))
Latvian Institute Of Organic Synthesis
Curated by ChEMBL
LigandPNGBDBM50010899(CHEMBL3264803)
Affinity DataIC50:  140nM. Assay description: Inhibition of human cathepsin-D using DABCYL-Glu-Arg-Nle-Phe-Leu-Ser-Phe-Pro-EDANS as substrate preincubated for 30 mins by FRET assay
In DepthDetails ArticlePubMed
TargetPlasmepsin II(Plasmodium falciparum)
Latvian Institute Of Organic Synthesis
Curated by ChEMBL
LigandPNGBDBM50010899(CHEMBL3264803)
Affinity DataIC50:  190nM. Assay description: Inhibition of Plasmodium falciparum plasmepsin-2 using DABCYL-Glu-Arg-Nle-Phe-Leu-Ser-Phe-Pro-EDANS as substrate preincubated for 30 mins by FRET ass...
In DepthDetails ArticlePubMed
TargetPlasmepsin I(Plasmodium falciparum)
Latvian Institute Of Organic Synthesis
Curated by ChEMBL
LigandPNGBDBM50010899(CHEMBL3264803)
Affinity DataIC50:  350nM. Assay description: Inhibition of Plasmodium falciparum plasmepsin-1 using DABCYL-Glu-Arg-Nle-Phe-Leu-Ser-Phe-Pro-EDANS as substrate preincubated for 30 mins by FRET ass...
In DepthDetails ArticlePubMed