BDBM50013225 1-Benzyl-6-methoxy-4-methyl-2,3-dihydro-1H-pyrrolo[3,2-c]quinoline::CHEMBL151290
SMILES COc1cccc2c3N(Cc4ccccc4)CCc3c(C)nc12
InChI Key InChIKey=MPOOERYIVIPUFA-UHFFFAOYSA-N
Data  1 IC50
  Tab Delimited (TSV)   2D SDfile   Computed 3D by Vconf -m prep SDfile
Find this compound or compounds like it in BindingDB:
Activity Spreadsheet -- Enzyme Inhibition Constant Data from BindingDB
Found 1 hit for monomerid = 50013225
TargetPotassium-transporting ATPase alpha chain 1(Sus scrofa (Pig))
Smith Kline & French Research
Curated by ChEMBL
LigandPNGBDBM50013225(1-Benzyl-6-methoxy-4-methyl-2,3-dihydro-1H-pyrrolo...)
Affinity DataIC50:  1.10E+4nM. Assay description: In vitro inhibition of H+/K+ ATPase activity was determined in gastric vesicles of pig using ATPase assay with pH 7
In DepthDetails ArticlePubMed