BDBM50013230 6-Methoxy-1-(4-methoxy-2-methyl-phenyl)-4-methyl-2,3-dihydro-1H-pyrrolo[3,2-c]quinoline::CHEMBL357510
SMILES COc1ccc(N2CCc3c2c2cccc(OC)c2nc3C)c(C)c1
InChI Key InChIKey=IILAIBOJQPWABN-UHFFFAOYSA-N
Data  1 IC50
  Tab Delimited (TSV)   2D SDfile   Computed 3D by Vconf -m prep SDfile
Find this compound or compounds like it in BindingDB:
Activity Spreadsheet -- Enzyme Inhibition Constant Data from BindingDB
Found 1 hit for monomerid = 50013230
TargetPotassium-transporting ATPase alpha chain 1(Sus scrofa (Pig))
Smith Kline & French Research
Curated by ChEMBL
LigandPNGBDBM50013230(6-Methoxy-1-(4-methoxy-2-methyl-phenyl)-4-methyl-2...)
Affinity DataIC50:  1.00E+3nM. Assay description: In vitro inhibition of H+/K+ ATPase activity was determined in gastric vesicles of pig using ATPase assay with pH 7
In DepthDetails ArticlePubMed