BDBM50013234 6-Methoxy-1-(2-methoxy-phenyl)-4-methyl-2,3-dihydro-1H-pyrrolo[3,2-c]quinoline::CHEMBL147246
SMILES COc1ccccc1N1CCc2c1c1cccc(OC)c1nc2C
InChI Key InChIKey=ZVCLXPNROWCWPR-UHFFFAOYSA-N
Data  1 IC50
  Tab Delimited (TSV)   2D SDfile   Computed 3D by Vconf -m prep SDfile
Find this compound or compounds like it in BindingDB:
Activity Spreadsheet -- Enzyme Inhibition Constant Data from BindingDB
Found 1 hit for monomerid = 50013234
TargetPotassium-transporting ATPase alpha chain 1(Sus scrofa (Pig))
Smith Kline & French Research
Curated by ChEMBL
LigandPNGBDBM50013234(6-Methoxy-1-(2-methoxy-phenyl)-4-methyl-2,3-dihydr...)
Affinity DataIC50:  1.60E+3nM. Assay description: In vitro inhibition of H+/K+ ATPase activity was determined in gastric vesicles of pig using ATPase assay with pH 7
In DepthDetails ArticlePubMed