BDBM50013239 1-(2,6-Dimethyl-phenyl)-4-methyl-2,3-dihydro-1H-pyrrolo[3,2-c]quinoline::CHEMBL149052
SMILES Cc1cccc(C)c1N1CCc2c1c1ccccc1nc2C
InChI Key InChIKey=SQZPUIQPGWJIBO-UHFFFAOYSA-N
Data  1 IC50
  Tab Delimited (TSV)   2D SDfile   Computed 3D by Vconf -m prep SDfile
Find this compound or compounds like it in BindingDB:
Activity Spreadsheet -- Enzyme Inhibition Constant Data from BindingDB
Found 1 hit for monomerid = 50013239
TargetPotassium-transporting ATPase alpha chain 1(Sus scrofa (Pig))
Smith Kline & French Research
Curated by ChEMBL
LigandPNGBDBM50013239(1-(2,6-Dimethyl-phenyl)-4-methyl-2,3-dihydro-1H-py...)
Affinity DataIC50:  1.50E+3nM. Assay description: In vitro inhibition of H+/K+ ATPase activity was determined in gastric vesicles of pig using ATPase assay with pH 7
In DepthDetails ArticlePubMed