BDBM50013943 CHEMBL327270::Furan-2-carboxylic acid (2-chloro-phenyl)-(3-methyl-1-phenethyl-piperidin-4-yl)-amide
SMILES CC1CN(CCc2ccccc2)CCC1N(C(=O)c1ccco1)c1ccccc1Cl
InChI Key InChIKey=AUFUBWNAAOCRHM-UHFFFAOYSA-N
Data  1 KI
  Tab Delimited (TSV)   2D SDfile   Computed 3D by Vconf -m prep SDfile
Find this compound or compounds like it in BindingDB:
Activity Spreadsheet -- Enzyme Inhibition Constant Data from BindingDB
Found 1 hit for monomerid = 50013943
TargetMu-type opioid receptor(Rattus norvegicus (rat))
Anaquest Pharmaceuticals
Curated by ChEMBL
LigandPNGBDBM50013943(CHEMBL327270 | Furan-2-carboxylic acid (2-chloro-p...)
Affinity DataKi:  0.130nM. Assay description: Ability to displace [3H]-naloxone from the Opioid receptor mu 1 isolated from the rat brain membranes.
In DepthDetails ArticlePubMed