BDBM50013947 CHEMBL95786::Furan-2-carboxylic acid (2-methoxy-phenyl)-[3-methyl-1-(2-thiophen-2-yl-ethyl)-piperidin-4-yl]-amide
SMILES COc1ccccc1N(C1CCN(CCc2cccs2)CC1C)C(=O)c1ccco1
InChI Key InChIKey=ZUTDWEZJQLTNOA-UHFFFAOYSA-N
Data  1 KI
  Tab Delimited (TSV)   2D SDfile   Computed 3D by Vconf -m prep SDfile
Find this compound or compounds like it in BindingDB:
Activity Spreadsheet -- Enzyme Inhibition Constant Data from BindingDB
Found 1 hit for monomerid = 50013947
TargetMu-type opioid receptor(Rattus norvegicus (rat))
Anaquest Pharmaceuticals
Curated by ChEMBL
LigandPNGBDBM50013947(CHEMBL95786 | Furan-2-carboxylic acid (2-methoxy-p...)
Affinity DataKi:  2nM. Assay description: Ability to displace [3H]-naloxone from the Opioid receptor mu 1 isolated from the rat brain membranes.
In DepthDetails ArticlePubMed