BDBM50014009 2,4,6-Trimethyl-1,4-dihydro-pyridine-3,5-dicarboxylic acid 3-(2-ethylsulfanyl-ethyl) ester 5-methyl ester::CHEMBL321486
SMILES CCSCCOC(=O)C1=C(C)N=C(C)C(C1C)C(=O)OC
InChI Key InChIKey=KVVMWZXEMDXAJY-UHFFFAOYSA-N
Data  1 KI
  Tab Delimited (TSV)   2D SDfile   Computed 3D by Vconf -m prep SDfile
Find this compound or compounds like it in BindingDB:
Activity Spreadsheet -- Enzyme Inhibition Constant Data from BindingDB
Found 1 hit for monomerid = 50014009
TargetPlatelet-activating factor receptor(Cavia porcellus)
Alter
Curated by ChEMBL
LigandPNGBDBM50014009(2,4,6-Trimethyl-1,4-dihydro-pyridine-3,5-dicarboxy...)
Affinity DataKi:  505nM. Assay description: Tested for inhibition of [3H]PAF binding to rabbit platelet Platelet activating factor receptor
In DepthDetails ArticlePubMed