BDBM50014013 2,4,6-Trimethyl-1,4-dihydro-pyridine-3,5-dicarboxylic acid 3-methyl ester 5-(2-methylsulfanyl-ethyl) ester::CHEMBL108238
SMILES COC(=O)C1C(C)C(C(=O)OCCSC)=C(C)N=C1C
InChI Key InChIKey=DFMUNRRJZBYGHI-UHFFFAOYSA-N
Data  1 KI
  Tab Delimited (TSV)   2D SDfile   Computed 3D by Vconf -m prep SDfile
Find this compound or compounds like it in BindingDB:
Activity Spreadsheet -- Enzyme Inhibition Constant Data from BindingDB
Found 1 hit for monomerid = 50014013
TargetPlatelet-activating factor receptor(Cavia porcellus)
Alter
Curated by ChEMBL
LigandPNGBDBM50014013(2,4,6-Trimethyl-1,4-dihydro-pyridine-3,5-dicarboxy...)
Affinity DataKi:  603nM. Assay description: Tested for inhibition of [3H]PAF binding to rabbit platelet Platelet activating factor receptor
In DepthDetails ArticlePubMed