BDBM50014272 CHEMBL3221245
SMILES CC1=C(C(C=C(N1)c1ccc(C)cc1)c1ccc(C)cc1)C(=O)SC(C)(C)C
InChI Key InChIKey=LLDHTTUPQLNXDV-UHFFFAOYSA-N
Data  1 IC50
  Tab Delimited (TSV)   2D SDfile   Computed 3D by Vconf -m prep SDfile
Find this compound or compounds like it in BindingDB:
Activity Spreadsheet -- Enzyme Inhibition Constant Data from BindingDB
Found 1 hit for monomerid = 50014272
TargetVoltage-dependent L-type calcium channel subunit alpha-1D(Homo sapiens (Human))
Universidad Complutense
Curated by ChEMBL
LigandPNGBDBM50014272(CHEMBL3221245)
Affinity DataIC50: >1.00E+5nM. Assay description: Inhibition of human Cav1.3 channel in human SH-SY5Y cells assessed as 70 mM K+ induced calcium elevation compound treated 15 mins before stimulus by ...
In DepthDetails ArticlePubMed