BDBM50014580 CHEMBL3261753
SMILES Cl.CSCC[C@H](N)C(=O)NCC(=O)N[C@H]1C[C@H](N(C1)S(=O)(=O)c1ccc(C)cc1)C(=O)NO
InChI Key InChIKey=DHHHDKINBVBFKW-GEUPQXMHSA-N
Data  2 IC50
  Tab Delimited (TSV)   2D SDfile   Computed 3D by Vconf -m prep SDfile
Find this compound or compounds like it in BindingDB:
Activity Spreadsheet -- Enzyme Inhibition Constant Data from BindingDB
Found 2 hits for monomerid = 50014580
Target72 kDa type IV collagenase(Homo sapiens (Human))
Shandong University
Curated by ChEMBL
LigandPNGBDBM50014580(CHEMBL3261753)
Affinity DataIC50:  1.03E+3nM. Assay description: Inhibition of MMP2 (unknown origin) using succinylated gelatin as substrate preincubated for 10 mins before substrate addition measured after 30 mins...
In DepthDetails ArticlePubMed
TargetAminopeptidase N(Sus scrofa (Pig))
Shandong University
Curated by ChEMBL
LigandPNGBDBM50014580(CHEMBL3261753)
Affinity DataIC50: >1.00E+5nM. Assay description: Inhibition of pig kidney microsomal APN using L-Leu-p-nitroanilide as substrate preincubated for 5 mins before substrate addition measured after 30 m...
In DepthDetails ArticlePubMed