BDBM50014591 CHEMBL3261764
SMILES Cl.N[C@@H](Cc1ccccc1)C(=O)NCC(=O)N[C@H]1C[C@H](N(C1)S(=O)(=O)c1ccc(Cl)cc1)C(=O)NO
InChI Key InChIKey=NBOWPBKPMMPMSS-HDHUNYPFSA-N
Data  3 IC50
  Tab Delimited (TSV)   2D SDfile   Computed 3D by Vconf -m prep SDfile
Find this compound or compounds like it in BindingDB:
Activity Spreadsheet -- Enzyme Inhibition Constant Data from BindingDB
Found 3 hits for monomerid = 50014591
TargetAminopeptidase N(Sus scrofa (Pig))
Shandong University
Curated by ChEMBL
LigandPNGBDBM50014591(CHEMBL3261764)
Affinity DataIC50:  9.00E+4nM. Assay description: Inhibition of pig kidney microsomal APN using L-Leu-p-nitroanilide as substrate preincubated for 5 mins before substrate addition measured after 30 m...
In DepthDetails ArticlePubMed
Target72 kDa type IV collagenase(Homo sapiens (Human))
Shandong University
Curated by ChEMBL
LigandPNGBDBM50014591(CHEMBL3261764)
Affinity DataIC50:  430nM. Assay description: Inhibition of MMP2 (unknown origin) using succinylated gelatin as substrate preincubated for 10 mins before substrate addition measured after 30 mins...
In DepthDetails ArticlePubMed
Target72 kDa type IV collagenase(Homo sapiens (Human))
Shandong University
Curated by ChEMBL
LigandPNGBDBM50014591(CHEMBL3261764)
Affinity DataIC50:  2.47E+4nM. Assay description: Inhibition of MMP2 in human SKOV3 cell suspension using succinylated gelatin as substrate preincubated for 10 mins before substrate addition measured...
In DepthDetails ArticlePubMed