BDBM50015203 4-Pentadeca-1,3,6-trienylsulfanyl-butyric acid methyl ester::CHEMBL422751
SMILES CCCCCCCC\C=C/C\C=C/C=C/SCCCC(=O)OC
InChI Key InChIKey=BCCIWBSBPMCVDG-CVWBSBFRSA-N
Data  2 IC50
  Tab Delimited (TSV)   2D SDfile   Computed 3D by Vconf -m prep SDfile
Find this compound or compounds like it in BindingDB:
Activity Spreadsheet -- Enzyme Inhibition Constant Data from BindingDB
Found 2 hits for monomerid = 50015203
TargetPolyunsaturated fatty acid 5-lipoxygenase(Rattus norvegicus)
Molecular Therapeutics
Curated by ChEMBL
LigandPNGBDBM50015203(4-Pentadeca-1,3,6-trienylsulfanyl-butyric acid met...)
Affinity DataIC50:  6.20E+3nM. Assay description: Inhibition of 5-lipoxygenase in rat RBL-1 cells
In DepthDetails ArticlePubMed
TargetPolyunsaturated fatty acid 5-lipoxygenase(Homo sapiens (Human))
Molecular Therapeutics
Curated by ChEMBL
LigandPNGBDBM50015203(4-Pentadeca-1,3,6-trienylsulfanyl-butyric acid met...)
Affinity DataIC50:  6.00E+3nM. Assay description: Inhibitory activity against 5-lipoxygenase expressed from human polymorphonuclear cells
In DepthDetails ArticlePubMed