BDBM50015204 4-Pentadeca-1,3,6-trienylsulfanyl-butyric acid::CHEMBL16979
SMILES CCCCCCCC\C=C/C\C=C/C=C/SCCCC(O)=O
InChI Key InChIKey=YRBDHTFMZHCRCL-MPAZIYIRSA-N
Data  1 IC50
  Tab Delimited (TSV)   2D SDfile   Computed 3D by Vconf -m prep SDfile
Find this compound or compounds like it in BindingDB:
Activity Spreadsheet -- Enzyme Inhibition Constant Data from BindingDB
Found 1 hit for monomerid = 50015204
TargetPolyunsaturated fatty acid 5-lipoxygenase(Rattus norvegicus)
Molecular Therapeutics
Curated by ChEMBL
LigandPNGBDBM50015204(4-Pentadeca-1,3,6-trienylsulfanyl-butyric acid | C...)
Affinity DataIC50:  7.20E+3nM. Assay description: Inhibition of 5-lipoxygenase in rat RBL-1 cells
In DepthDetails ArticlePubMed