BDBM50015207 3-Pentadeca-1,3-dien-6-ynylsulfanyl-benzoic acid methyl ester::CHEMBL16893
SMILES CCCCCCCCC#CC\C=C/C=C/Sc1cccc(c1)C(=O)OC
InChI Key InChIKey=RVYVEFPIDDSYLV-GCYSJDCNSA-N
Data  1 IC50
  Tab Delimited (TSV)   2D SDfile   Computed 3D by Vconf -m prep SDfile
Find this compound or compounds like it in BindingDB:
Activity Spreadsheet -- Enzyme Inhibition Constant Data from BindingDB
Found 1 hit for monomerid = 50015207
TargetPolyunsaturated fatty acid 5-lipoxygenase(Rattus norvegicus)
Molecular Therapeutics
Curated by ChEMBL
LigandPNGBDBM50015207(3-Pentadeca-1,3-dien-6-ynylsulfanyl-benzoic acid m...)
Affinity DataIC50:  9.00E+3nM. Assay description: Inhibition of 5-lipoxygenase in rat RBL-1 cells
In DepthDetails ArticlePubMed