BDBM50015447 CHEMBL3265031
SMILES CC1(O)CCN(CC1)c1ccc(Nc2nc(cn3ccnc23)-c2ccc3cn[nH]c3c2)cc1
InChI Key InChIKey=DOVPFYVNKOVWHA-UHFFFAOYSA-N
Data  1 IC50  2 EC50
  Tab Delimited (TSV)   2D SDfile   Computed 3D by Vconf -m prep SDfile
Find this compound or compounds like it in BindingDB:
Activity Spreadsheet -- Enzyme Inhibition Constant Data from BindingDB
Found 3 hits for monomerid = 50015447
TargetTyrosine-protein kinase SYK(Homo sapiens (Human))
Gilead Sciences
Curated by ChEMBL
LigandPNGBDBM50015447(CHEMBL3265031)
Affinity DataIC50:  1.40nM. Assay description: Inhibition of full length Syk (unknown origin) using biotinylated peptide substrate
In DepthDetails ArticlePubMed
TargetTyrosine-protein kinase SYK(Homo sapiens (Human))
Gilead Sciences
Curated by ChEMBL
LigandPNGBDBM50015447(CHEMBL3265031)
Affinity DataEC50:  677nM. Assay description: Inhibition of Syk in goat antihuman IgE-induced CD63 expression in human whole blood by FACS analysis
In DepthDetails ArticlePubMed
TargetTyrosine-protein kinase SYK(Homo sapiens (Human))
Gilead Sciences
Curated by ChEMBL
LigandPNGBDBM50015447(CHEMBL3265031)
Affinity DataEC50:  15nM. Assay description: Inhibition of Syk in antihuman IgM-stimulated human Ramos cells assessed as decrease in BCR-mediated BLNK phosphorylation by cellular assay
In DepthDetails ArticlePubMed