BDBM50015828 (7,8-Difluoro-[1,2,4]triazolo[4,3-a]quinoxalin-4-yl)-isopropyl-amine::CHEMBL308833
SMILES CC(C)Nc1nc2cc(F)c(F)cc2n2cnnc12
InChI Key InChIKey=UOYMWQJPVWUNBD-UHFFFAOYSA-N
Data  1 IC50
  Tab Delimited (TSV)   2D SDfile   Computed 3D by Vconf -m prep SDfile
Find this compound or compounds like it in BindingDB:
Activity Spreadsheet -- Enzyme Inhibition Constant Data from BindingDB
Found 1 hit for monomerid = 50015828
TargetAdenosine receptor A1(Rattus norvegicus (rat))
Pfizer
Curated by ChEMBL
LigandPNGBDBM50015828((7,8-Difluoro-[1,2,4]triazolo[4,3-a]quinoxalin-4-y...)
Affinity DataIC50:  1.90E+3nM. Assay description: Binding affinity towards the adenosine A1 receptor in cerebral cortices of Sprague-Dawley male rats using [3H]CHA as radioligand.
In DepthDetails ArticlePubMed