BDBM50015990 CHEMBL124843::[1-Benzyl-5-(1-cyclohexylmethyl-2-hydroxy-4-isobutylcarbamoyl-pent-4-enylamino)-2-hydroxy-4-methyl-pentyl]-carbamic acid tert-butyl ester
SMILES CC(C)CNC(=O)C(=C)C[C@H](O)[C@H](CC1CCCCC1)NC[C@H](C)C[C@@H](O)[C@H](Cc1ccccc1)NC(=O)OC(C)(C)C
InChI Key InChIKey=OPWQZMHPNHTPHV-OJQOTFAISA-N
Data  1 IC50
  Tab Delimited (TSV)   2D SDfile   Computed 3D by Vconf -m prep SDfile
Find this compound or compounds like it in BindingDB:
Activity Spreadsheet -- Enzyme Inhibition Constant Data from BindingDB
Found 1 hit for monomerid = 50015990
TargetRenin(Homo sapiens (Human))
Abbott Laboratories
Curated by ChEMBL
LigandPNGBDBM50015990(CHEMBL124843 | [1-Benzyl-5-(1-cyclohexylmethyl-2-h...)
Affinity DataIC50: >1.00E+4nM. Assay description: In vitro inhibitory activity against human renal renin using radioimmuno assay for angiotensin I production
In DepthDetails ArticlePubMed