BDBM50015993 CHEMBL123941::[1-Benzyl-4-(1-cyclohexylmethyl-2-hydroxy-3-hydroxymethyl-5-methyl-hexylcarbamoyl)-2-hydroxy-6-methyl-heptyl]-carbamic acid tert-butyl ester
SMILES CC(C)C[C@H](CO)[C@H](O)[C@H](CC1CCCCC1)NC(=O)[C@H](CC(C)C)C[C@@H](O)[C@H](Cc1ccccc1)NC(=O)OC(C)(C)C
InChI Key InChIKey=LZYCDYVACWGQDQ-JKGQRNBUSA-N
Data  1 IC50
  Tab Delimited (TSV)   2D SDfile   Computed 3D by Vconf -m prep SDfile
Find this compound or compounds like it in BindingDB:
Activity Spreadsheet -- Enzyme Inhibition Constant Data from BindingDB
Found 1 hit for monomerid = 50015993
TargetRenin(Homo sapiens (Human))
Abbott Laboratories
Curated by ChEMBL
LigandPNGBDBM50015993(CHEMBL123941 | [1-Benzyl-4-(1-cyclohexylmethyl-2-h...)
Affinity DataIC50:  6nM. Assay description: In vitro inhibitory activity against human renal renin using radioimmuno assay for angiotensin I production
In DepthDetails ArticlePubMed