BDBM50015994 (2S)-[{1-[1-(1-Cyclohexylmethyl-2-hydroxy-4-isobutylcarbamoyl-pent-4-enylcarbamoyl)-ethylcarbamoyl]-2-phenyl-ethyl}-carbamic acid tert-butyl ester::CHEMBL340907
SMILES CC(C)CNC(=O)C(=C)C[C@H](O)[C@H](CC1CCCCC1)NC(=O)C(C)NC(=O)[C@H](Cc1ccccc1)NC(=O)OC(C)(C)C
InChI Key InChIKey=QOMAMPFLZMKZSC-MQWYVQAMSA-N
Data  1 IC50
  Tab Delimited (TSV)   2D SDfile   Computed 3D by Vconf -m prep SDfile
Find this compound or compounds like it in BindingDB:
Activity Spreadsheet -- Enzyme Inhibition Constant Data from BindingDB
Found 1 hit for monomerid = 50015994
TargetRenin(Homo sapiens (Human))
Abbott Laboratories
Curated by ChEMBL
LigandPNGBDBM50015994((2S)-[{1-[1-(1-Cyclohexylmethyl-2-hydroxy-4-isobut...)
Affinity DataIC50:  10nM. Assay description: In vitro inhibitory activity against human renal renin using radioimmuno assay for angiotensin I production
In DepthDetails ArticlePubMed