BDBM50016068 (1-Benzyl-2-{1-[1-(2-{1-[1-(2-benzylcarbamoyl-1-hydroxy-ethyl)-3-methyl-butylcarbamoyl]-ethylcarbamoyl}-1-hydroxy-ethyl)-3-methyl-butylcarbamoyl]-2-phenyl-ethanesulfinyl}-ethyl)-carbamic acid tert-butyl ester::CHEMBL435470
SMILES CC(C)C[C@H](NC(=O)[C@H](C)NC(=O)CC(O)[C@H](CC(C)C)NC(=O)[C@H](Cc1ccccc1)S(=O)C[C@H](Cc1ccccc1)NC(=O)OC(C)(C)C)C(O)CC(=O)NCc1ccccc1
InChI Key InChIKey=FEZMDZAMQCWHKX-ZAQKYYGMSA-N
Data  1 IC50
  Tab Delimited (TSV)   2D SDfile   Computed 3D by Vconf -m prep SDfile
Find this compound or compounds like it in BindingDB:
Activity Spreadsheet -- Enzyme Inhibition Constant Data from BindingDB
Found 1 hit for monomerid = 50016068
TargetRenin(Homo sapiens (Human))
Warner-Lambert
Curated by ChEMBL
LigandPNGBDBM50016068((1-Benzyl-2-{1-[1-(2-{1-[1-(2-benzylcarbamoyl-1-hy...)
Affinity DataIC50:  5.60E+3nM. Assay description: Inhibitory activity against human renin
In DepthDetails ArticlePubMed