BDBM50016503 Boc-Asp-D-Tyr(SO3Na)-Nle-Gly-Trp-Nle-Asp-Phe-NH2::CHEMBL218455
SMILES CCCC[C@H](NC(=O)[C@@H](Cc1ccc(OS([O-])(=O)=O)cc1)NC(=O)OC(C)(C)C)C(=O)NCC(=O)N[C@@H](Cc1c[nH]c2ccccc12)C(=O)N[C@@H](CCCC)C(=O)N[C@@H](CC(O)=O)C(=O)N[C@@H](Cc1ccccc1)C(N)=O
InChI Key InChIKey=CSXIDZJPJYRGSK-PHHHQBPDSA-M
Data  2 KI
  Tab Delimited (TSV)   2D SDfile   Computed 3D by Vconf -m prep SDfile
Find this compound or compounds like it in BindingDB:
Activity Spreadsheet -- Enzyme Inhibition Constant Data from BindingDB
Found 2 hits for monomerid = 50016503
TargetCholecystokinin receptor type A(Cavia porcellus)
University Of Paris
Curated by ChEMBL
LigandPNGBDBM50016503(Boc-Asp-D-Tyr(SO3Na)-Nle-Gly-Trp-Nle-Asp-Phe-NH2 |...)
Affinity DataKi:  3nM. Assay description: The compound was tested for the inhibition of [3H]-Propionyl specific binding to Cholecystokinin 8 receptor of guinea pig brain
In DepthDetails ArticlePubMed
TargetCholecystokinin receptor type A(Cavia porcellus)
University Of Paris
Curated by ChEMBL
LigandPNGBDBM50016503(Boc-Asp-D-Tyr(SO3Na)-Nle-Gly-Trp-Nle-Asp-Phe-NH2 |...)
Affinity DataKi:  33nM. Assay description: The compound was tested for the inhibition of [3H]-Propionyl specific binding to Cholecystokinin 8 receptor of guinea pig pancreatic membrane
In DepthDetails ArticlePubMed