BDBM50017358 CHEMBL3286416
SMILES Oc1c(C(=O)Nc2ccccc2)c2ccc(cc2c(=O)n1O)[N+]([O-])=O
InChI Key InChIKey=YEMSFVVYSAHUHY-UHFFFAOYSA-N
Data  1 IC50
  Tab Delimited (TSV)   2D SDfile   Computed 3D by Vconf -m prep SDfile
Find this compound or compounds like it in BindingDB:
Activity Spreadsheet -- Enzyme Inhibition Constant Data from BindingDB
Found 1 hit for monomerid = 50017358
TargetIntegrase(Human immunodeficiency virus 1)
University Of Lille
Curated by ChEMBL
LigandPNGBDBM50017358(CHEMBL3286416)
Affinity DataIC50:  10nM. Assay description: Inhibition of HIV-1 overall integrase activity using 5'-digoxigenin-labeled GACCCTTTTAGTCAGTGTGGAAAATCTCTAGCAGT-3' as substrate after 1 hr by ELISA
In DepthDetails ArticlePubMed