BDBM50017970 CHEMBL3289647
SMILES Cc1ccc(nc1)N1CCN(CCCSc2ccc(F)cc2)CC1
InChI Key InChIKey=FLNJSRMYQSEHEU-UHFFFAOYSA-N
Data  5 KI
  Tab Delimited (TSV)   2D SDfile   Computed 3D by Vconf -m prep SDfile
Find this compound or compounds like it in BindingDB:
Activity Spreadsheet -- Enzyme Inhibition Constant Data from BindingDB
Found 5 hits for monomerid = 50017970
TargetD(4) dopamine receptor(RAT)
Florida A&M University
Curated by ChEMBL
LigandPNGBDBM50017970(CHEMBL3289647)
Affinity DataKi:  20nM. Assay description: Displacement of [3H]N-methylspiperone from rat dopamine D4 receptor by PDSP assay
In DepthDetails ArticlePubMed
TargetD(3) dopamine receptor(Homo sapiens (Human))
Florida A&M University
Curated by ChEMBL
LigandPNGBDBM50017970(CHEMBL3289647)
Affinity DataKi:  170nM. Assay description: Displacement of [3H]N-methylspiperone from human dopamine D3 receptor by PDSP assay
In DepthDetails ArticlePubMed
TargetD(1A) dopamine receptor(Homo sapiens (Human))
Florida A&M University
Curated by ChEMBL
LigandPNGBDBM50017970(CHEMBL3289647)
Affinity DataKi:  222nM. Assay description: Displacement of [3H]SCH23390 from human dopamine D1 receptor by PDSP assay
In DepthDetails ArticlePubMed
TargetD(2) dopamine receptor(Homo sapiens (Human))
Florida A&M University
Curated by ChEMBL
LigandPNGBDBM50017970(CHEMBL3289647)
Affinity DataKi:  1.10E+3nM. Assay description: Displacement of [3H]N-methylspiperone from human dopamine D2 receptor by PDSP assay
In DepthDetails ArticlePubMed
TargetD(1B) dopamine receptor(Homo sapiens (Human))
Florida A&M University
Curated by ChEMBL
LigandPNGBDBM50017970(CHEMBL3289647)
Affinity DataKi:  2.16E+3nM. Assay description: Displacement of [3H]SCH23390 from human dopamine D5 receptor by PDSP assay
In DepthDetails ArticlePubMed