BDBM50018586 8-Dipropylamino-6,7,8,9-tetrahydro-5H-benzocyclohepten-1-ol::CHEMBL74760
SMILES CCCN(CCC)[C@@H]1CCCc2cccc(O)c2C1
InChI Key InChIKey=JNSMDZNFZCBLFV-OAHLLOKOSA-N
Data  1 KI
  Tab Delimited (TSV)   2D SDfile   Computed 3D by Vconf -m prep SDfile
Find this compound or compounds like it in BindingDB:
Activity Spreadsheet -- Enzyme Inhibition Constant Data from BindingDB
Found 1 hit for monomerid = 50018586
Target5-hydroxytryptamine receptor 1A(Rattus norvegicus (rat))
University Of Uppsala
Curated by ChEMBL
LigandPNGBDBM50018586(8-Dipropylamino-6,7,8,9-tetrahydro-5H-benzocyclohe...)
Affinity DataKi:  30nM. Assay description: Affinity of the compound for 5-hydroxytryptamine 1A receptor site
In DepthDetails ArticlePubMed