BDBM50018626 CHEMBL3291002
SMILES OP(O)(=O)C(NS(=O)(=O)c1ccc(Br)cc1)P(O)(O)=O
InChI Key InChIKey=QKVWIEXPHPPFNL-UHFFFAOYSA-N
Data  6 IC50
  Tab Delimited (TSV)   2D SDfile   Computed 3D by Vconf -m prep SDfile
Find this compound or compounds like it in BindingDB:
Activity Spreadsheet -- Enzyme Inhibition Constant Data from BindingDB
Found 6 hits for monomerid = 50018626
TargetCarbonic anhydrase 1(Homo sapiens (Human))
Universit£
Curated by ChEMBL
LigandPNGBDBM50018626(CHEMBL3291002)
Affinity DataIC50: >1.00E+4nM. Assay description: Inhibition of human recombinant carbonic anhydrase 1 pretreated for 15 mins by stopped flow CO2 hydrase assay
In DepthDetails ArticlePubMed
TargetCarbonic anhydrase 2(Homo sapiens (Human))
Universit£
Curated by ChEMBL
LigandPNGBDBM50018626(CHEMBL3291002)
Affinity DataIC50: >1.00E+4nM. Assay description: Inhibition of human recombinant carbonic anhydrase 2 pretreated for 15 mins by stopped flow CO2 hydrase assay
In DepthDetails ArticlePubMed
TargetCarbonic anhydrase 14(Homo sapiens (Human))
Universit£
Curated by ChEMBL
LigandPNGBDBM50018626(CHEMBL3291002)
Affinity DataIC50:  898nM. Assay description: Inhibition of human recombinant carbonic anhydrase 14 pretreated for 15 mins by stopped flow CO2 hydrase assay
In DepthDetails ArticlePubMed
TargetCarbonic anhydrase 9(Homo sapiens (Human))
Universit£
Curated by ChEMBL
LigandPNGBDBM50018626(CHEMBL3291002)
Affinity DataIC50:  234nM. Assay description: Inhibition of human recombinant carbonic anhydrase 9 pretreated for 15 mins by stopped flow CO2 hydrase assay
In DepthDetails ArticlePubMed
TargetCarbonic anhydrase 12(Homo sapiens (Human))
Universit£
Curated by ChEMBL
LigandPNGBDBM50018626(CHEMBL3291002)
Affinity DataIC50:  62nM. Assay description: Inhibition of human recombinant carbonic anhydrase 12 pretreated for 15 mins by stopped flow CO2 hydrase assay
In DepthDetails ArticlePubMed
Target72 kDa type IV collagenase(Homo sapiens (Human))
Universit£
Curated by ChEMBL
LigandPNGBDBM50018626(CHEMBL3291002)
Affinity DataIC50:  4.80E+3nM. Assay description: Inhibition of human recombinant MMP-2 pretreated for 30 mins measured 2 to 4 hrs after Mca-Pro-Leu-Gly-Leu-Dpa-Ala-Arg-NH2 substrate addition by fluo...
In DepthDetails ArticlePubMed