BDBM50018915 2-(4-Butyl-phenylamino)-9-(2-hydroxy-ethoxymethyl)-1,9-dihydro-purin-6-one::CHEMBL16185
SMILES CCCCc1ccc(Nc2nc3n(COCCO)cnc3c(=O)[nH]2)cc1
InChI Key InChIKey=FTTOTLVQWYDVIL-UHFFFAOYSA-N
Data  1 EC50
  Tab Delimited (TSV)   2D SDfile   Computed 3D by Vconf -m prep SDfile
Find this compound or compounds like it in BindingDB:
Activity Spreadsheet -- Enzyme Inhibition Constant Data from BindingDB
Found 1 hit for monomerid = 50018915
TargetThymidine kinase(Human herpesvirus 1 (strain SC16) (HHV-1) (Human h...)
Istituto Di Genetica Biochimica Ed Evoluzionistica
Curated by ChEMBL
LigandPNGBDBM50018915(2-(4-Butyl-phenylamino)-9-(2-hydroxy-ethoxymethyl)...)
Affinity DataEC50:  1.40E+5nM. Assay description: Inhibition of [3H]-MCC binding to torpedo electroplax membranes
In DepthDetails ArticlePubMed