BDBM50020409 CHEMBL3289810
SMILES Nc1nc2ccc(OCC(F)(F)F)nc2n1CC(O)c1ccc(cc1Cl)C(F)(F)F
InChI Key InChIKey=VTCWFCGQSIOJEL-UHFFFAOYSA-N
Data  1 IC50
  Tab Delimited (TSV)   2D SDfile   Computed 3D by Vconf -m prep SDfile
Find this compound or compounds like it in BindingDB:
Activity Spreadsheet -- Enzyme Inhibition Constant Data from BindingDB
Found 1 hit for monomerid = 50020409
TargetPotassium voltage-gated channel subfamily H member 2(Homo sapiens (Human))
Astrazeneca
Curated by ChEMBL
LigandPNGBDBM50020409(CHEMBL3289810)
Affinity DataIC50: >3.33E+4nM. Assay description: Inhibition of human ERG
In DepthDetails ArticlePubMed