BDBM50020421 CHEMBL3289792
SMILES Nc1nccn1CC(O)c1ccc(Cl)cc1F
InChI Key InChIKey=BHVJFZCDKTUUOM-UHFFFAOYSA-N
Data  1 IC50
  Tab Delimited (TSV)   2D SDfile   Computed 3D by Vconf -m prep SDfile
Find this compound or compounds like it in BindingDB:
Activity Spreadsheet -- Enzyme Inhibition Constant Data from BindingDB
Found 1 hit for monomerid = 50020421
TargetPotassium voltage-gated channel subfamily H member 2(Homo sapiens (Human))
Astrazeneca
Curated by ChEMBL
LigandPNGBDBM50020421(CHEMBL3289792)
Affinity DataIC50:  6.00E+4nM. Assay description: Inhibition of human ERG
In DepthDetails ArticlePubMed