BDBM50020515 2-(Hydroxyimino-methyl)-3-methyl-1-(naphthalen-1-ylmethoxymethyl)-3H-imidazol-1-ium; chloride::CHEMBL33332
SMILES Cn1cc[n+](COCc2cccc3ccccc23)c1CN=O
InChI Key InChIKey=KZSJCMLTEAIJED-UHFFFAOYSA-N
Data  1 KI  5 IC50
  Tab Delimited (TSV)   2D SDfile   Computed 3D by Vconf -m prep SDfile
Find this compound or compounds like it in BindingDB:
Activity Spreadsheet -- Enzyme Inhibition Constant Data from BindingDB
Found 6 hits for monomerid = 50020515
TargetAcetylcholinesterase(Electrophorus electricus (Electric eel))
Sri International
Curated by ChEMBL
LigandPNGBDBM50020515(2-(Hydroxyimino-methyl)-3-methyl-1-(naphthalen-1-y...)
Affinity DataKi:  3.50E+3nM. Assay description: Compound was tested for the competitive inhibition of phosphorylation of Eel acetylcholinesterase (AChE)
In DepthDetails ArticlePubMed
TargetAcetylcholinesterase(Electrophorus electricus (Electric eel))
Sri International
Curated by ChEMBL
LigandPNGBDBM50020515(2-(Hydroxyimino-methyl)-3-methyl-1-(naphthalen-1-y...)
Affinity DataIC50:  7.00E+3nM. Assay description: Inhibition of eel acetylcholinesterase (AChE) activity by 50%
In DepthDetails ArticlePubMed
TargetCholine O-acetyltransferase(RAT)
Sri International
Curated by ChEMBL
LigandPNGBDBM50020515(2-(Hydroxyimino-methyl)-3-methyl-1-(naphthalen-1-y...)
Affinity DataIC50:  7.00E+3nM. Assay description: Compound was tested for the competitive inhibition of acetylcholinesterase (AChE)
In DepthDetails ArticlePubMed
TargetAcetylcholinesterase(Bos taurus (bovine))
Sri International
Curated by ChEMBL
LigandPNGBDBM50020515(2-(Hydroxyimino-methyl)-3-methyl-1-(naphthalen-1-y...)
Affinity DataIC50:  4.20E+3nM. Assay description: Inhibition of acetylcholinesterase (AChE) in bovine erythrocyte(RBC)
In DepthDetails ArticlePubMed
TargetMuscarinic acetylcholine receptor M1/M2/M3/M4/M5(Mus musculus)
Sri International
Curated by ChEMBL
LigandPNGBDBM50020515(2-(Hydroxyimino-methyl)-3-methyl-1-(naphthalen-1-y...)
Affinity DataIC50:  3.50E+4nM. Assay description: Compound was tested for the binding affinity towards muscarinic receptor in mouse brain membrane
In DepthDetails ArticlePubMed
TargetAcetylcholinesterase(Homo sapiens (Human))
Sri International
Curated by ChEMBL
LigandPNGBDBM50020515(2-(Hydroxyimino-methyl)-3-methyl-1-(naphthalen-1-y...)
Affinity DataIC50:  3.80E+3nM. Assay description: Concentration required to inhibit 50% of acetylcholinesterase (AChE) in human erythrocyte(RBC).
In DepthDetails ArticlePubMed