BDBM50020588 CHEMBL270718
SMILES Clc1ccccc1-c1nc2c([nH]1)c1ccccc1c1ccccc21
InChI Key InChIKey=WANOSZNOBPFLFO-UHFFFAOYSA-N
Data  1 IC50
  Tab Delimited (TSV)   2D SDfile   Computed 3D by Vconf -m prep SDfile
Find this compound or compounds like it in BindingDB:
Activity Spreadsheet -- Enzyme Inhibition Constant Data from BindingDB
Found 1 hit for monomerid = 50020588
TargetProstaglandin E synthase(Homo sapiens (Human))
University Jena
Curated by ChEMBL
LigandPNGBDBM50020588(CHEMBL270718)
Affinity DataIC50:  20nM. Assay description: Inhibition of mPGES1-mediated PGE2 production in microsomes of IL-1beta stimulated human A549 cells preincubated for 15 mins by RP-HPLC analysis
In DepthDetails ArticlePubMed