BDBM50021015 8-(2-Amino-4-nitro-phenyl)-1,3-dimethyl-3,7-dihydro-purine-2,6-dione::CHEMBL11037
SMILES Cn1c2nc([nH]c2c(=O)n(C)c1=O)-c1ccc(cc1N)[N+]([O-])=O
InChI Key InChIKey=ICGTYVBXXUETOI-UHFFFAOYSA-N
Data  1 IC50
  Tab Delimited (TSV)   2D SDfile   Computed 3D by Vconf -m prep SDfile
Find this compound or compounds like it in BindingDB:
Activity Spreadsheet -- Enzyme Inhibition Constant Data from BindingDB
Found 1 hit for monomerid = 50021015
TargetAdenosine receptor A1(BOVINE)
TBA
Curated by ChEMBL
LigandPNGBDBM50021015(8-(2-Amino-4-nitro-phenyl)-1,3-dimethyl-3,7-dihydr...)
Affinity DataIC50:  2.5nM. Assay description: Binding affinity against bovine brain adenosine A1 receptor by using N6-[3H]- cyclohexyladenosineChecked by Author
In DepthDetails ArticlePubMed