BDBM50022305 CHEMBL123739::N-{2-Hydroxy-1-isobutyl-4-[1-(2-isobutyrylamino-1-methyl-2-oxo-ethylcarbamoyl)-ethylamino]-butyl}-3-methyl-2-(3-methyl-butyrylamino)-butyramide
SMILES CC(C)C[C@H](NC(=O)C(NC(=O)CC(C)C)C(C)C)[C@@H](O)CC(C)C(=O)NC(C)C(=O)NC(=O)C(C)C
InChI Key InChIKey=PEGDKLMWMSJXHC-IPHNJEJOSA-N
Data  1 KI
  Tab Delimited (TSV)   2D SDfile   Computed 3D by Vconf -m prep SDfile
Find this compound or compounds like it in BindingDB:
Activity Spreadsheet -- Enzyme Inhibition Constant Data from BindingDB
Found 1 hit for monomerid = 50022305
TargetPepsin A(Porcine)
TBA
Curated by ChEMBL
LigandPNGBDBM50022305(CHEMBL123739 | N-{2-Hydroxy-1-isobutyl-4-[1-(2-iso...)
Affinity DataKi:  3nM. Assay description: Inhibition of porcine pepsin
In DepthDetails ArticlePubMed