BDBM50022507 CHEMBL3349407::H2N-His-Pro-Phe-His-Sta-Leu-PheOMe
SMILES CC(C)C[C@H](NC(=O)[C@H](Cc1c[nH]cn1)NC(=O)[C@H](Cc1ccccc1)NC(=O)[C@@H]1CCCN1C(=O)[C@@H](N)Cc1c[nH]cn1)C(O)CC(=O)N[C@@H](CC(C)C)C(=O)N[C@@H](Cc1ccccc1)C(N)=O
InChI Key InChIKey=ODUCLFWAICXWKU-DKIOFMPXSA-N
Data  2 KI
  Tab Delimited (TSV)   2D SDfile   Computed 3D by Vconf -m prep SDfile
Find this compound or compounds like it in BindingDB:
Activity Spreadsheet -- Enzyme Inhibition Constant Data from BindingDB
Found 2 hits for monomerid = 50022507
TargetRenin(Homo sapiens (Human))
University Of Wisconsin
Curated by ChEMBL
LigandPNGBDBM50022507(CHEMBL3349407 | H2N-His-Pro-Phe-His-Sta-Leu-PheOMe)
Affinity DataKi:  8nMpH: 7.4Assay Description:Inhibition of human renin at pH 7.4
In DepthDetails ArticlePubMed
TargetPepsin A(Porcine)
University Of Wisconsin
Curated by ChEMBL
LigandPNGBDBM50022507(CHEMBL3349407 | H2N-His-Pro-Phe-His-Sta-Leu-PheOMe)
Affinity DataKi:  34nMpH: 4.0Assay Description:Inhibition of porcine pepsin at pH 4.0
In DepthDetails ArticlePubMed