BDBM50023391 CHEMBL162814::{4-[1-(4-Amino-3-iodo-benzyl)-2,6-dioxo-3-propyl-2,3,6,9-tetrahydro-1H-purin-8-yl]-phenoxy}-acetic acid
SMILES CCCn1c2nc([nH]c2c(=O)n(Cc2ccc(N)c(I)c2)c1=O)-c1ccc(OCC(O)=O)cc1
InChI Key InChIKey=MMUQMGJPHOIRRP-UHFFFAOYSA-N
Data  1 KI  1 Kd
  Tab Delimited (TSV)   2D SDfile   Computed 3D by Vconf -m prep SDfile
Find this compound or compounds like it in BindingDB:
Activity Spreadsheet -- Enzyme Inhibition Constant Data from BindingDB
Found 1 hit for monomerid = 50023391
TargetAdenosine receptor A2a/A2b(Homo sapiens (Human))
University Of Virginia School Of Medicine
Curated by ChEMBL
LigandPNGBDBM50023391(CHEMBL162814 | {4-[1-(4-Amino-3-iodo-benzyl)-2,6-d...)
Affinity DataKi:  1.80E+3nM. Assay description: Inhibition of NECA binding to adenosine A2 receptor mediates reduced adenylate cyclase activity in human platelets
In DepthDetails ArticlePubMed