BDBM50023400 (4-{1,3-Bis-[2-(4-amino-phenyl)-ethyl]-2,6-dioxo-2,3,6,9-tetrahydro-1H-purin-8-yl}-phenoxy)-acetic acid::CHEMBL161934
SMILES Nc1ccc(CCn2c3[nH]c(nc3c(=O)n(CCc3ccc(N)cc3)c2=O)-c2ccc(OCC(O)=O)cc2)cc1
InChI Key InChIKey=PAQHFWXGUKCBBX-UHFFFAOYSA-N
Data  1 KI  1 Kd
  Tab Delimited (TSV)   2D SDfile   Computed 3D by Vconf -m prep SDfile
Find this compound or compounds like it in BindingDB:
Activity Spreadsheet -- Enzyme Inhibition Constant Data from BindingDB
Found 1 hit for monomerid = 50023400
TargetAdenosine receptor A2a/A2b(Homo sapiens (Human))
University Of Virginia School Of Medicine
Curated by ChEMBL
LigandPNGBDBM50023400((4-{1,3-Bis-[2-(4-amino-phenyl)-ethyl]-2,6-dioxo-2...)
Affinity DataKi: >1.00E+5nM. Assay description: Inhibition of NECA binding to adenosine A2 receptor mediates reduced adenylate cyclase activity in human platelets
In DepthDetails ArticlePubMed