BDBM50023877 4-(4-Amino-imidazo[4,5-c]pyridin-1-yl)-but-2-en-1-ol::CHEMBL49737
SMILES Nc1nccc2n(C\C=C/CO)cnc12
InChI Key InChIKey=UPOPWDPXTWJIEQ-UPHRSURJSA-N
Data  1 KI  1 IC50
  Tab Delimited (TSV)   2D SDfile   Computed 3D by Vconf -m prep SDfile
Find this compound or compounds like it in BindingDB:
Activity Spreadsheet -- Enzyme Inhibition Constant Data from BindingDB
Found 1 hit for monomerid = 50023877
TargetAdenosylhomocysteinase(Homo sapiens (Human))
University Of Kansas
Curated by ChEMBL
LigandPNGBDBM50023877(4-(4-Amino-imidazo[4,5-c]pyridin-1-yl)-but-2-en-1-...)
Affinity DataKi:  200nM. Assay description: Inhibition against bovine-liver S-Adenosyl-homocysteine (AdoHcy) hydrolase
In DepthDetails ArticlePubMed