BDBM50024163 4-[2-(4-{2-[2-Benzyloxycarbonylamino-3-(1H-indol-3-yl)-propionylamino]-3-methyl-butyrylamino}-3-hydroxy-6-methyl-heptanoylamino)-propionylamino]-3-hydroxy-6-methyl-heptanoic acid methyl ester::CHEMBL3142784
SMILES COC(=O)C[C@H](O)[C@H](CC(C)C)NC(=O)[C@H](C)NC(=O)C[C@H](O)[C@H](CC(C)C)NC(=O)[C@@H](NC(=O)[C@H](Cc1c[nH]c2ccccc12)NC(=O)OCc1ccccc1)C(C)C
InChI Key InChIKey=OBRHZWCYAVPXND-UHFFFAOYSA-N
Data  7 IC50
  Tab Delimited (TSV)   2D SDfile   Computed 3D by Vconf -m prep SDfile
Find this compound or compounds like it in BindingDB:
Activity Spreadsheet -- Enzyme Inhibition Constant Data from BindingDB
Found 7 hits for monomerid = 50024163
TargetRenin(Rattus norvegicus)
TBA
Curated by ChEMBL
LigandPNGBDBM50024163(4-[2-(4-{2-[2-Benzyloxycarbonylamino-3-(1H-indol-3...)
Affinity DataIC50:  22nM. Assay description: Inhibition of dog plasma renin activity
In DepthDetails ArticlePubMed
TargetRenin(Homo sapiens (Human))
TBA
Curated by ChEMBL
LigandPNGBDBM50024163(4-[2-(4-{2-[2-Benzyloxycarbonylamino-3-(1H-indol-3...)
Affinity DataIC50:  42nM. Assay description: In vitro inhibitory activity against dog plasma renin
In DepthDetails ArticlePubMed
TargetRenin(Homo sapiens (Human))
TBA
Curated by ChEMBL
LigandPNGBDBM50024163(4-[2-(4-{2-[2-Benzyloxycarbonylamino-3-(1H-indol-3...)
Affinity DataIC50:  150nM. Assay description: In vitro inhibitory activity against rat plasma renin
In DepthDetails ArticlePubMed
TargetRenin(Homo sapiens (Human))
TBA
Curated by ChEMBL
LigandPNGBDBM50024163(4-[2-(4-{2-[2-Benzyloxycarbonylamino-3-(1H-indol-3...)
Affinity DataIC50:  150nM. Assay description: In vitro inhibitory activity against human plasma renin
In DepthDetails ArticlePubMed
TargetRenin(Homo sapiens (Human))
TBA
Curated by ChEMBL
LigandPNGBDBM50024163(4-[2-(4-{2-[2-Benzyloxycarbonylamino-3-(1H-indol-3...)
Affinity DataIC50:  25nM. Assay description: In vitro inhibitory activity against man (human) plasma renin
In DepthDetails ArticlePubMed
TargetRenin(Homo sapiens (Human))
TBA
Curated by ChEMBL
LigandPNGBDBM50024163(4-[2-(4-{2-[2-Benzyloxycarbonylamino-3-(1H-indol-3...)
Affinity DataIC50:  151nM. Assay description: Inhibition of human plasma renin
In DepthDetails ArticlePubMed
TargetRenin(Rattus norvegicus)
TBA
Curated by ChEMBL
LigandPNGBDBM50024163(4-[2-(4-{2-[2-Benzyloxycarbonylamino-3-(1H-indol-3...)
Affinity DataIC50:  15nM. Assay description: In vitro inhibitory activity against man (human) plasma renin
In DepthDetails ArticlePubMed