BDBM50024654 CHEMBL3334992
SMILES ONC(=O)c1ccc(cc1)N1CCN(C1=O)c1cccnc1
InChI Key InChIKey=CFQSWABMYGITKP-UHFFFAOYSA-N
Data  1 IC50
  Tab Delimited (TSV)   2D SDfile   Computed 3D by Vconf -m prep SDfile
Find this compound or compounds like it in BindingDB:
Activity Spreadsheet -- Enzyme Inhibition Constant Data from BindingDB
Found 1 hit for monomerid = 50024654
TargetHistone deacetylase 1(Homo sapiens (Human))
Shanghai Huilun Life Sciences & Technology
Curated by ChEMBL
LigandPNGBDBM50024654(CHEMBL3334992)
Affinity DataIC50:  182nM. Assay description: Inhibition of HDAC1 (unknown origin) using Boc-Lys(Ac)-AMC as substrate by fluorescence assay
In DepthDetails ArticlePubMed