BDBM50025717 5-(4-Amino-phenyl)-1,3-dimethyl-1,6-dihydro-pyrazolo[4,3-d]pyrimidin-7-one::CHEMBL367705
SMILES Cc1nn(C)c2c1nc([nH]c2=O)-c1ccc(N)cc1
InChI Key InChIKey=ADQCDAFPEZXGEW-UHFFFAOYSA-N
Data  1 IC50
  Tab Delimited (TSV)   2D SDfile   Computed 3D by Vconf -m prep SDfile
Find this compound or compounds like it in BindingDB:
Activity Spreadsheet -- Enzyme Inhibition Constant Data from BindingDB
Found 1 hit for monomerid = 50025717
TargetAdenosine receptor A1(Rattus norvegicus (rat))
TBA
Curated by ChEMBL
LigandPNGBDBM50025717(5-(4-Amino-phenyl)-1,3-dimethyl-1,6-dihydro-pyrazo...)
Affinity DataIC50:  380nM. Assay description: Binding affinity against adenosine A1 receptor in rat brain membrane preparations using N6-[3H]-cyclohexyladenosine as a radioligand
In DepthDetails ArticlePubMed